strain,virus,gisaid_epi_isl,genbank_accession,date,region,country,division,location,region_exposure,country_exposure,division_exposure,segment,length,host,age,sex,Nextstrain_clade,pangolin_lineage,GISAID_clade,originating_lab,submitting_lab,authors,url,title,paper_url,date_submitted,purpose_of_sequencing
hCoV-19/Morocco/20356934/2021,betacoronavirus,EPI_ISL_4798130,?,2021-09-01 00:00:00,Africa,Morocco,Casablanca,,Africa,Morocco,Casablanca,genome,29769,Human,33,Female,?,AY.33,GK,Medical Virology and BSL3 Laboratory,Centre de SÃ©quenÃ§age GÃ©nomique,"EL Hamouchi Adil, Charoute Hicham , Bouzidi Aymane, Amalou Ghita, Harmak Houda, Anga Latifa, Faouzi Abdellah, Zemmouri Faouzia, El Oualid Abdelmjid, Nadifiyine Saloua, Zouheir Yassine, Omondi Francis Carey, Somda Soro Georgina Charlene, Abbad Anas, Chgouri Fatima, Dersi Noureddine, Nourlil Jalal, Barakat Abdelhamid, Maaroufi Abderrahmane",https://www.gisaid.org/,?,?,2021-10-04 00:00:00,?
hCoV-19/Morocco/HMIMV-P4279CCA/2020,betacoronavirus,EPI_ISL_2968067,?,2020-12-07 00:00:00,Africa,Morocco,Rabat,,Africa,Morocco,Rabat,genome,29836,Human,51,Male,?,B.1,GH,Centre de Virologie des Maladies  infectueuses Tropicales,"Functional Genomic Platform UATRS-biology, CNRST","Nadia EL MRIMAR, Sanaa ALAOUI-Amine, Elmostafa BENAISSA, Charifa DRISSI TOUZANI, Nadia TOUIL, Marouane MELLOUL, Hicham EL ANNAZ, Hemlali Mouhssine, Mostafa ELOUENNASS, Idriss-Amine LAHLOU, Khalid ENNIBI, Elmostafa EL FAHIME",https://www.gisaid.org/,?,?,2021-07-15 00:00:00,?
hCoV-19/Morocco/HMIMV-2N/2020,betacoronavirus,EPI_ISL_2968047,?,2020-07-18 00:00:00,Africa,Morocco,Rabat,,Africa,Morocco,Rabat,genome,29836,Human,44,Female,?,B.1.78,G,Centre de Virologie des Maladies  infectueuses Tropicales,"Functional Genomic Platform UATRS-biology, CNRST","Rida TAGAJDID, Hicham EL ANNAZ, Hemlali Mouhssine, Elmostafa EL FAHIME, Marouane MELLOUL, Youssef AKHOUAD, Mly Abdelaziz ELALAOUI, Ahmed REGGAD, Sanaa ALAOUI-Amine, Rachid ABI, Zohour KASMY, Safae ELKOCHRI, Nadia TOUIL, Mostafa ELOUENNASS, Idriss-Amine LAHLOU, Khalid ENNIBI",https://www.gisaid.org/,?,?,2021-07-15 00:00:00,?
hCoV-19/Morocco/HMIMV-ALT-G/2020,betacoronavirus,EPI_ISL_2968062,?,2020-12-07 00:00:00,Africa,Morocco,Rabat,,Africa,Morocco,Rabat,genome,29844,Human,55,Female,?,B.1,G,Centre de Virologie des Maladies  infectueuses Tropicales,"Functional Genomic Platform UATRS-biology, CNRST","Elmostafa BENAISSA, Nadia TOUIL, Elmostafa EL FAHIME, Marouane MELLOUL, Youssef AKHOUAD, Mly Abdelaziz ELALAOUI, Ahmed REGGAD, Hicham EL ANNAZ, Hemlali Mouhssine, Sanaa ALAOUI-Amine, Rachid ABI, Rida TAGAJDID, Zohour KASMY, Safae ELKOCHRI, Mostafa ELOUENNASS, Idriss-Amine LAHLOU, Khalid ENNIBI",https://www.gisaid.org/,?,?,2021-07-15 00:00:00,?
hCoV-19/Morocco/6893/2020,betacoronavirus,EPI_ISL_459971,?,2020-03-18 00:00:00,Africa,Morocco,,,Africa,Morocco,,genome,29782,Human,unknown,unknown,?,B.1.153,G,Institut Pasteur du Maroc,Institut Pasteur du Maroc,"Marion Barbet, Sylvie Behillil, MÃ©line Bizard, Angela Brisebarre, Camille Capel, Etienne Simon-LoriÃ¨re, Vincent Enouf, Maud Vanpeene, Sylvie van der Werf, Latifa Anga, Abdellah Faouzi, Anass Abbad, Mjid Eloualid, Jalal Nourlil, Anderrahmane Maaroufi",https://www.gisaid.org/,?,?,2020-06-05 00:00:00,?
hCoV-19/Morocco/FMP-1/2021,betacoronavirus,EPI_ISL_5061472,?,2021-01-02 00:00:00,Africa,Morocco,Khemisset,,Africa,Morocco,Khemisset,genome,29826,Human,65,Female,?,B.1.177,GV,Laboratoire central de Virologie,Laboratoire de Biotechnologie,"Mouna Ouadghiri, Tarik Aanniz, Safae El Mazouri, SaaÃ¯d Amzazi, Lahcen Belyamani and Azeddine Ibrahimi",https://www.gisaid.org/,?,?,2021-10-12 00:00:00,?
hCoV-19/Morocco/FMP-78/2021,betacoronavirus,EPI_ISL_1117289,?,2021-01-06 00:00:00,Africa,Morocco,Sidi Lahcen,,Africa,Morocco,Sidi Lahcen,genome,29826,Human,33,Male,?,B.1,G,Laboratoire central de Virologie,Laboratoire de Biotechnologie,"Hakima Kabbaj, Myriam Seffar, Ghizlane EL Amin, Amal Zouaki, Abdelomunim Essabbar, Tarik Aanniz, Mouna Ouadghiri, SaaÃ¯d Amzazi, Lahcen Belyamani and Azeddine Ibrahimi",https://www.gisaid.org/,?,?,2021-03-02 00:00:00,?
hCoV-19/Morocco/6896/2020,betacoronavirus,EPI_ISL_459974,?,2020-03-20 00:00:00,Africa,Morocco,,,Africa,Morocco,,genome,29831,Human,unknown,unknown,?,B.1,G,Institut Pasteur du Maroc,Institut Pasteur du Maroc,"Marion Barbet, Sylvie Behillil, MÃ©line Bizard, Angela Brisebarre, Camille Capel, Etienne Simon-LoriÃ¨re, Vincent Enouf, Maud Vanpeene, Sylvie van der Werf, Latifa Anga, Abdellah Faouzi, Anass Abbad, Mjid Eloualid, Jalal Nourlil, Anderrahmane Maaroufi",https://www.gisaid.org/,?,?,2020-06-05 00:00:00,?
hCoV-19/Morocco/FMP-239/2021,betacoronavirus,EPI_ISL_5126276,?,2021-03-24 00:00:00,Africa,Morocco,Rabat,,Africa,Morocco,Rabat,genome,29849,Human,69,Male,?,B.1,G,Laboratoire central de Virologie,Laboratoire de Biotechnologie,"Hakima Kabbaj, Myriam Seffar, Ghizlane EL Amin, Amal Zouaki, Abdelomunim Essabbar, Tarik Aanniz, Mouna Ouadghiri, SaaÃ¯d Amzazi, Lahcen Belyamani and Azeddine Ibrahim",https://www.gisaid.org/,?,?,2021-10-14 00:00:00,?
hCoV-19/Morocco/FMP-66/2021,betacoronavirus,EPI_ISL_1103576,?,2021-02-04 00:00:00,Africa,Morocco,Sidi Lahcen,,Africa,Morocco,Sidi Lahcen,genome,29811,Human,27,Female,?,B.1,G,Laboratoire central de Virologie,Laboratoire de Biotechnologie,"Myriam Seffar, Hakima Kabbaj, Ghizlane EL Amin, Amal Zouaki, Mouna Ouadghiri, Tarik Aanniz, Abdelomunim Essabbar, SaaÃ¯d Amzazi, Lahcen Belyamani and Azeddine Ibrahimi",https://www.gisaid.org/,?,?,2021-03-01 00:00:00,?
hCoV-19/Morocco/HMIMV-IKRP1/2020,betacoronavirus,EPI_ISL_2968065,?,2020-12-07 00:00:00,Africa,Morocco,Rabat,,Africa,Morocco,Rabat,genome,29841,Human,51,Male,?,B.1,G,Centre de Virologie des Maladies  infectueuses Tropicales,"Functional Genomic Platform UATRS-biology, CNRST","Ikram BNOUYAHIA, Sanaa ALAOUI-Amine, Elmostafa BENAISSA, Nadia TOUIL, Marouane MELLOUL, Hicham EL ANNAZ, Hemlali Mouhssine, Mostafa ELOUENNASS, Idriss-Amine LAHLOU, Khalid ENNIBI, Elmostafa EL FAHIME",https://www.gisaid.org/,?,?,2021-07-15 00:00:00,?
hCoV-19/Morocco/FMP-82/2021,betacoronavirus,EPI_ISL_1159698,?,2021-01-02 00:00:00,Africa,Morocco,My Youssef,,Africa,Morocco,My Youssef,genome,29832,Human,30,Female,?,B.1.1,GR,Laboratoire central de Virologie,Laboratoire de Biotechnologie,"Tarik Aanniz, Mouna Ouadghiri, Abdelomunim Essabbar, Ghizlane EL Amin, Amal Zouaki, Myriam Seffar, Hakima Kabbaj, SaaÃ¯d Amzazi, Lahcen Belyamani and Azeddine Ibrahimi",https://www.gisaid.org/,?,?,2021-03-05 00:00:00,?
hCoV-19/Morocco/126/2021,betacoronavirus,EPI_ISL_8134525,?,2021-12-20 00:00:00,Africa,Morocco,Marrakech,,Africa,Morocco,Marrakech,genome,29779,Human,unknown,Female,?,BA.1.1,GRA,NIH,National Institute of Hygiene,"Hassan Ihazmade,Bimouhen Abderrahman,Zakia Regragui,Fatima El Falaki,Hicham Oumzil",https://www.gisaid.org/,?,?,2021-12-28 00:00:00,?
hCoV-19/Morocco/SCS62/2021,betacoronavirus,EPI_ISL_8132259,?,2021-09-20 00:00:00,Africa,Morocco,,,Africa,Morocco,,genome,29903,Human,unknown,Male,?,AY.33,GK,Laboratoire de Recherche et d'Analyses MÃ©dicales  de la Gendarmerie Royale,Laboratoire de Recherche et d'Analyses MÃ©dicales  de la Gendarmerie Royale,"SanaÃ¢ LEMRISS, Mohamed Mouatakid, Amal SOUIRI, Hajar LEMRISS, Mohamed LABIOUI, Nabil LEMZAOUI, SaÃ¢d EL KABBAJ",https://www.gisaid.org/,?,?,2021-12-28 00:00:00,?
hCoV-19/Morocco/LRA211/2021,betacoronavirus,EPI_ISL_8132278,?,2021-07-22 00:00:00,Africa,Morocco,,,Africa,Morocco,,genome,29884,Human,unknown,Male,?,B.1.1.7,GRY,Laboratoire de Recherche et d'Analyses Medicales  de la Gendarmerie Royale,Laboratoire de Recherche et d'Analyses Medicales  de la Gendarmerie Royale,"SanaÃ¢ LEMRISS, Mohamed Mouatakid, Amal SOUIRI, Hajar LEMRISS, Mohamed LABIOUI, Nabil LEMZAOUI, SaÃ¢d EL KABBAJ",https://www.gisaid.org/,?,?,2021-12-28 00:00:00,?
hCoV-19/Morocco/160/2021,betacoronavirus,EPI_ISL_8135033,?,2021-12-20 00:00:00,Africa,Morocco,Rabat,,Africa,Morocco,Rabat,genome,29779,Human,unknown,Male,?,BA.1,GRA,National Institute of Hygiene,National Institute of Hygiene,"Hassan Ihazmade,Bimouhen Abderrahman,Zakia Regragui,Fatima El Falaki,Hicham Oumzil",https://www.gisaid.org/,?,?,2021-12-28 00:00:00,?
hCoV-19/Morocco/163/2021,betacoronavirus,EPI_ISL_8135547,?,2021-12-20 00:00:00,Africa,Morocco,Tangier,,Africa,Morocco,Tangier,genome,29779,Human,unknown,Female,?,BA.1.1,GRA,NIH,National Institute of Hygiene,"Hassan Ihazmade,Bimouhen Abderrahman,Zakia Regragui,Fatima El Falaki,Hicham Oumzil",https://www.gisaid.org/,?,?,2021-12-28 00:00:00,?
hCoV-19/Morocco/127/2021,betacoronavirus,EPI_ISL_8135334,?,2021-12-20 00:00:00,Africa,Morocco,Marrakech,,Africa,Morocco,Marrakech,genome,29779,Human,unknown,Female,?,BA.1.1,GRA,NIH,National Institute of Hygiene,"Hassan Ihazmade,Bimouhen Abderrahman,Zakia Regragui,Fatima El Falaki,Hicham Oumzil",https://www.gisaid.org/,?,?,2021-12-28 00:00:00,?
hCoV-19/Morocco/Ion_code_2/2021,betacoronavirus,EPI_ISL_3155073,?,2021-06-17 00:00:00,Africa,Morocco,casablanca,,Africa,Morocco,casablanca,genome,29816,Human,40,Male,?,B.1.1.7,GRY,ANOUAL,ANOUAL,"Fatima zahra el ansari, Farah Jouali, Yassine Kasmi, Mohcine Bennani Mechita, Rachid Benhida, Jamal Fekkak.",https://www.gisaid.org/,?,?,2021-07-31 00:00:00,?
hCoV-19/Morocco/147/2021,betacoronavirus,EPI_ISL_8144259,?,2021-12-22 00:00:00,Africa,Morocco,Kenitra,,Africa,Morocco,Kenitra,genome,29770,Human,unknown,Female,?,BA.1,GRA,National Institute of Hygiene,National Institute of Hygiene,"Hassan Ihazmade,Bimouhen Abderrahman,Zakia Regragui,Fatima El Falaki,Hicham Oumzil",https://www.gisaid.org/,?,?,2021-12-28 00:00:00,?
hCoV-19/Morocco/101/2021,betacoronavirus,EPI_ISL_8144261,?,2021-12-21 00:00:00,Africa,Morocco,Fes,,Africa,Morocco,Fes,genome,29779,Human,unknown,Male,?,BA.1,GRA,National Institute of Hygiene,National Institute of Hygiene,"Hassan Ihazmade,Bimouhen Abderrahman,Zakia Regragui,Fatima El Falaki,Hicham Oumzil",https://www.gisaid.org/,?,?,2021-12-28 00:00:00,?
hCoV-19/Morocco/ION_CODE_4/2021,betacoronavirus,EPI_ISL_3155339,?,2021-06-17 00:00:00,Africa,Morocco,Casablanca,,Africa,Morocco,Casablanca,genome,29837,Human,23,Male,?,AY.51,GK,ANOUAL,ANOUAL,"Fatima Zahra El ansari, Farah Jouali, Yassine Kasmi, Mohcine Bennani Mechita, Rachid Benhida, Jamal Fekkak.",https://www.gisaid.org/,?,?,2021-07-31 00:00:00,?
hCoV-19/Morocco/119/2021,betacoronavirus,EPI_ISL_8144254,?,2021-12-22 00:00:00,Africa,Morocco,Tanger,,Africa,Morocco,Tanger,genome,29770,Human,unknown,Male,?,BA.1.1,GRA,National Institute of Hygiene,National Institute of Hygiene,"Hassan Ihazmade,Bimouhen Abderrahman,Zakia Regragui,Fatima El Falaki,Hicham Oumzil",https://www.gisaid.org/,?,?,2021-12-28 00:00:00,?
hCoV-19/Morocco/113/2021,betacoronavirus,EPI_ISL_8144257,?,2021-12-22 00:00:00,Africa,Morocco,Tanger,,Africa,Morocco,Tanger,genome,29770,Human,unknown,Male,?,BA.1.1,GRA,National Institute of Hygiene,National Institute of Hygiene,"Hassan Ihazmade,Bimouhen Abderrahman,Zakia Regragui,Fatima El Falaki,Hicham Oumzil",https://www.gisaid.org/,?,?,2021-12-28 00:00:00,?
hCoV-19/Morocco/166/2021,betacoronavirus,EPI_ISL_8144262,?,2021-12-24 00:00:00,Africa,Morocco,Tanger,,Africa,Morocco,Tanger,genome,29779,Human,unknown,Male,?,BA.1.1,GRA,National Institute of Hygiene,National Institute of Hygiene,"Hassan Ihazmade,Bimouhen Abderrahman,Zakia Regragui,Fatima El Falaki,Hicham Oumzil",https://www.gisaid.org/,?,?,2021-12-28 00:00:00,?
hCoV-19/Morocco/99/2021,betacoronavirus,EPI_ISL_8144263,?,2021-12-21 00:00:00,Africa,Morocco,Fes,,Africa,Morocco,Fes,genome,29770,Human,unknown,Male,?,BA.1.1,GRA,National Institute of Hygiene,National Institute of Hygiene,"Hassan Ihazmade,Bimouhen Abderrahman,Zakia Regragui,Fatima El Falaki,Hicham Oumzil",https://www.gisaid.org/,?,?,2021-12-28 00:00:00,?
hCoV-19/Morocco/6904/2020,betacoronavirus,EPI_ISL_459982,?,2020-04-18 00:00:00,Africa,Morocco,,,Africa,Morocco,,genome,29843,Human,unknown,unknown,?,B.1,GH,Institut Pasteur du Maroc,Institut Pasteur du Maroc,"Marion Barbet, Sylvie Behillil, MÃ©line Bizard, Angela Brisebarre, Camille Capel, Etienne Simon-LoriÃ¨re, Vincent Enouf, Maud Vanpeene, Sylvie van der Werf, Latifa Anga, Abdellah Faouzi, Anass Abbad, Mjid Eloualid, Jalal Nourlil, Anderrahmane Maaroufi",https://www.gisaid.org/,?,?,2020-06-05 00:00:00,?
hCoV-19/Morocco/FMP-327/2021,betacoronavirus,EPI_ISL_4572272,?,2021-07-12 00:00:00,Africa,Morocco,Rabat,,Africa,Morocco,Rabat,genome,29847,Human,unknown,Male,?,AY.51,GK,Institut National d'HygiÃ¨ne / Consortium National de Veille GÃ©nomique - Maroc,Laboratoire de Biotechnologie,"Mouna Ouadghiri, Tarik Aanniz, Safaa ElMazouri, SaaÃ¯d Amzazi, Lahcen Belyamani and Azeddine Ibrahimi",https://www.gisaid.org/,?,?,2021-09-29 00:00:00,?
hCoV-19/Morocco/FMP-323/2021,betacoronavirus,EPI_ISL_4572233,?,2021-07-12 00:00:00,Africa,Morocco,Ouarzazate,,Africa,Morocco,Ouarzazate,genome,29839,Human,unknown,Male,?,B.1.617.2,GK,Institut National d'HygiÃ¨ne / Consortium National de Veille GÃ©nomique - Maroc,Laboratoire de Biotechnologie,"Mouna Ouadghiri, Tarik Aanniz, Safaa ElMazouri, SaaÃ¯d Amzazi, Lahcen Belyamani and Azeddine Ibrahimi",https://www.gisaid.org/,?,?,2021-09-29 00:00:00,?
hCoV-19/Morocco/6888/2020,betacoronavirus,EPI_ISL_459966,?,2020-03-15 00:00:00,Africa,Morocco,,,Africa,Morocco,,genome,29782,Human,unknown,unknown,?,B.1.1,GR,Institut Pasteur du Maroc,Institut Pasteur du Maroc,"Marion Barbet, Sylvie Behillil, MÃ©line Bizard, Angela Brisebarre, Camille Capel, Etienne Simon-LoriÃ¨re, Vincent Enouf, Maud Vanpeene, Sylvie van der Werf, Latifa Anga, Abdellah Faouzi, Anass Abbad, Mjid Eloualid, Jalal Nourlil, Anderrahmane Maaroufi",https://www.gisaid.org/,?,?,2020-06-05 00:00:00,?
hCoV-19/Morocco/HMIMV-39E/2020,betacoronavirus,EPI_ISL_2968039,?,2020-07-18 00:00:00,Africa,Morocco,Rabat,,Africa,Morocco,Rabat,genome,29844,Human,45,Female,?,B.1,G,Centre de Virologie des Maladies  infectueuses Tropicales,"Functional Genomic Platform UATRS-biology, CNRST","Hemlali Mouhssine, Marouane MELLOUL, Youssef AKHOUAD, Mly Abdelaziz ELALAOUI, Ahmed REGGAD, Sanaa ALAOUI-Amine, Rachid ABI, Rida TAGAJDID, Zohour KASMY, Safae ELKOCHRI, Nadia TOUIL, Hicham EL ANNAZ, Mostafa ELOUENNASS, Idriss-Amine LAHLOU, Khalid ENNIBI, Elmostafa EL FAHIME",https://www.gisaid.org/,?,?,2021-07-15 00:00:00,?
hCoV-19/Morocco/FMP-330/2021,betacoronavirus,EPI_ISL_4572416,?,2021-07-12 00:00:00,Africa,Morocco,Zagora,,Africa,Morocco,Zagora,genome,29814,Human,unknown,Female,?,AY.73,GK,nstitut National d'HygiÃ¨ne / Consortium National de Veille GÃ©nomique - Maroc,Laboratoire de Biotechnologie,"Mouna Ouadghiri, Tarik Aanniz, Safaa ElMazouri, SaaÃ¯d Amzazi, Lahcen Belyamani and Azeddine Ibrahimi",https://www.gisaid.org/,?,?,2021-09-29 00:00:00,?
hCoV-19/Morocco/FMP-340/2021,betacoronavirus,EPI_ISL_4573207,?,2021-07-13 00:00:00,Africa,Morocco,Agadir,,Africa,Morocco,Agadir,genome,29825,Human,unknown,Female,?,AY.51,GK,Institut National d'HygiÃ¨ne / Consortium National de Veille GÃ©nomique - Maroc,Laboratoire de Biotechnologie,"Mouna Ouadghiri, Safaa ElMazouri, Tarik Aanniz, SaaÃ¯d Amzazi, Lahcen Belyamani and Azeddine Ibrahimi",https://www.gisaid.org/,?,?,2021-09-29 00:00:00,?
hCoV-19/Morocco/RMPS-15/2020,betacoronavirus,EPI_ISL_482740,?,2020-05-26 00:00:00,Africa,Morocco,,,Africa,Morocco,,genome,29782,Human,unknown,Male,?,B.1,G,"LNR National Reference Laboratory, Mohammed VI University of Health Sciences","Medical Biotechnology Laboratory, Rabat Medical and Pharmacy School, Mohammed The Vth University in Rabat","Meriem LAAMARTI, Souad KARTTI, Rokia LAAMARTI, M.W. CHEMAO-ELFIHRI, Loubna ALLAM, Mouna OUADGHIRI, Imane SMYEJ, Jalila RAHOUI, Houda BENRAHMA, Jalil El ATAR, Idrissa DIAWARA, Rachid EL JAOUDI, Laila SBABOU, Chakib NEJJARI, Saaid AMZAZI, Rachid MENTAG, Lahcen BELYAMANI and Azeddine IBRAHIMI",https://www.gisaid.org/,?,?,2020-07-05 00:00:00,?
hCoV-19/Morocco/755/2022,betacoronavirus,EPI_ISL_13289795,?,2022-03-15 00:00:00,Africa,Morocco,Al Houceima,,Africa,Morocco,Al Houceima,genome,29746,Human,unknown,Female,?,BA.1,GRA,NIH-Rabat,NIC at National Institute of Hygiene,"Hassan Ihazmade, Abderrahman Bimouhen, Zakia Regragui, Fatima El Falaki, Hicham Oumzil, Mohammed Rajaoui",https://www.gisaid.org/,?,?,2022-06-14 00:00:00,?
hCoV-19/Morocco/INH-MN908947/2020,betacoronavirus,EPI_ISL_4899917,?,2020-02-02 00:00:00,Africa,Morocco,Rabat,,Africa,Morocco,Rabat,genome,29814,Human,66,Female,?,B.1,G,Laboratoire de virologie,"Functional Genomic Platform UATRS-biology, CNRST","Mohamed Rhajaoui, Hicham Oumzil, Fatima Elfalaki, Hassan Ihazmad, Abderrahmane Bimouhen, Zakia Regragui, Samira Benkeroum, Marouane Melloul, Sanaa Alaoui-Amine, Safae Ghoulame, Taha Chouati, Mouhssine Hemlali, Hamza Gharmaz, Elmostafa El fahime",https://www.gisaid.org/,?,?,2021-10-06 00:00:00,?
hCoV-19/Morocco/6891/2020,betacoronavirus,EPI_ISL_459969,?,2020-03-20 00:00:00,Africa,Morocco,,,Africa,Morocco,,genome,29788,Human,unknown,unknown,?,B.1,GH,Institut Pasteur du Maroc,Institut Pasteur du Maroc,"Marion Barbet, Sylvie Behillil, MÃ©line Bizard, Angela Brisebarre, Camille Capel, Etienne Simon-LoriÃ¨re, Vincent Enouf, Maud Vanpeene, Sylvie van der Werf, Latifa Anga, Abdellah Faouzi, Anass Abbad, Mjid Eloualid, Jalal Nourlil, Anderrahmane Maaroufi",https://www.gisaid.org/,?,?,2020-06-05 00:00:00,?
hCoV-19/Morocco/INH-105/2020,betacoronavirus,EPI_ISL_4899888,?,2020-02-02 00:00:00,Africa,Morocco,Rabat,,Africa,Morocco,Rabat,genome,29814,Human,65,Male,?,B.1.221,G,Laboratoire de virologie,"Functional Genomic Platform UATRS-biology, CNRST","Hicham Oumzil, Mohamed Rhajaoui, Fatima Elfalaki, Hassan Ihazmad, Abderrahmane Bimouhen, Zakia Regragui, Samira Benkeroum, Marouane Melloul, Sanaa Alaoui-Amine, Safae Ghoulame, Taha Chouati, Mouhssine Hemlali, Hamza Gharmaz, Elmostafa El fahime",https://www.gisaid.org/,?,?,2021-10-06 00:00:00,?
hCoV-19/Morocco/INH-104/2020,betacoronavirus,EPI_ISL_4899881,?,2020-02-02 00:00:00,Africa,Morocco,Rabat,,Africa,Morocco,Rabat,genome,29814,Human,57,Female,?,B.1,G,Laboratoire de virologie,"Functional Genomic Platform UATRS-biology, CNRST","Hicham Oumzil, Mohamed Rhajaoui, Fatima Elfalaki, Hassan Ihazmad, Abderrahmane Bimouhen, Zakia Regragui, Samira Benkeroum, Marouane Melloul, Sanaa Alaoui-Amine, Safae Ghoulame, Taha Chouati, Mouhssine Hemlali, Hamza Gharmaz, Elmostafa El fahime",https://www.gisaid.org/,?,?,2021-10-06 00:00:00,?
hCoV-19/Morocco/INH-103/2020,betacoronavirus,EPI_ISL_4899870,?,2020-02-02 00:00:00,Africa,Morocco,Rabat,,Africa,Morocco,Rabat,genome,29814,Human,63,Female,?,B.1,G,Laboratoire de virologie,"Functional Genomic Platform UATRS-biology, CNRST","Hicham Oumzil, Mohamed Rhajaoui, Fatima Elfalaki, Hassan Ihazmad, Abderrahmane Bimouhen, Zakia Regragui, Samira Benkeroum, Marouane Melloul, Sanaa Alaoui-Amine, Safae Ghoulame, Taha Chouati, Mouhssine Hemlali, Hamza Gharmaz, Elmostafa El fahime",https://www.gisaid.org/,?,?,2021-10-06 00:00:00,?
hCoV-19/Morocco/INH-107/2020,betacoronavirus,EPI_ISL_4899898,?,2020-02-02 00:00:00,Africa,Morocco,Rabat,,Africa,Morocco,Rabat,genome,29814,Human,55,Male,?,B.1.177,GV,Laboratoire de virologie,"Functional Genomic Platform UATRS-biology, CNRST","Mohamed Rhajaoui, Hicham Oumzil, Fatima Elfalaki, Hassan Ihazmad, Abderrahmane Bimouhen, Zakia Regragui, Samira Benkeroum, Marouane Melloul, Sanaa Alaoui-Amine, Safae Ghoulame, Taha Chouati, Mouhssine Hemlali, Hamza Gharmaz, Elmostafa El fahime",https://www.gisaid.org/,?,?,2021-10-06 00:00:00,?
hCoV-19/Morocco/Khouri101/2020,betacoronavirus,EPI_ISL_3200860,?,2020-05-06 00:00:00,Africa,Morocco,,,Africa,Morocco,,genome,29886,Human,66,Female,?,B.1,G,Laboratoire de Recherche et d'Analyses MÃ©dicales  de la Gendarmerie Royale,Laboratoire de Recherche et d'Analyses MÃ©dicales  de la Gendarmerie Royale,"SanaÃ¢ LEMRISS, Amal SOUIRI, SaÃ¢d EL KABBAJ",https://www.gisaid.org/,?,?,2021-08-03 00:00:00,?
hCoV-19/Morocco/HMIMV-279CCB/2020,betacoronavirus,EPI_ISL_2968069,?,2020-12-07 00:00:00,Africa,Morocco,Rabat,,Africa,Morocco,Rabat,genome,29836,Human,60,Female,?,B.1,GH,Centre de Virologie des Maladies  infectueuses Tropicales,"Functional Genomic Platform UATRS-biology, CNRST","Nadia TOUIL, Nadia EL MRIMAR, Marouane MELLOUL, Elmostafa EL FAHIME,  Mly Abdelaziz ELALAOUI, Hicham EL ANNAZ, Hemlali Mouhssine, Sanaa ALAOUI-Amine, Idriss-Amine LAHLOU, Mostafa ELOUENNASS, Khalid ENNIBI",https://www.gisaid.org/,?,?,2021-07-15 00:00:00,?
hCoV-19/Morocco/579/2022,betacoronavirus,EPI_ISL_13421933,?,2022-01-31 00:00:00,Africa,Morocco,Rabat,,Africa,Morocco,Rabat,genome,29779,Human,unknown,Male,?,BA.1,GRA,NIC  at NIH,National Institute of Hygiene,"Hassan Ihazmade, Bimouhen Abderrahman, Zakia Regragui, Fatima El Falaki, Hicham Oumzil, Rajaoui Mohammed",https://www.gisaid.org/,?,?,2022-06-23 00:00:00,?
hCoV-19/Morocco/734/2022,betacoronavirus,EPI_ISL_13289777,?,2022-03-30 00:00:00,Africa,Morocco,Rabat,,Africa,Morocco,Rabat,genome,29746,Human,unknown,Male,?,BA.1,GRA,NIH-Rabat,NIC at National Institute of Hygiene,"Hassan Ihazmade, Abderrahman Bimouhen, Zakia Regragui, Fatima El Falaki, Hicham Oumzil, Mohammed Rajaoui",https://www.gisaid.org/,?,?,2022-06-14 00:00:00,?
hCoV-19/Morocco/Sett44/2020,betacoronavirus,EPI_ISL_3204262,?,2020-05-03 00:00:00,Africa,Morocco,,,Africa,Morocco,,genome,29892,Human,23,Female,?,B.1,G,Laboratoire de Recherche et d'Analyses MÃ©dicales  de la Gendarmerie Royale,Laboratoire de Recherche et d'Analyses MÃ©dicales  de la Gendarmerie Royale,"SanaÃ¢ LEMRISS, Amal SOUIRI, SaÃ¢d EL KABBAJ",https://www.gisaid.org/,?,?,2021-08-03 00:00:00,?
hCoV-19/Morocco/534/2022,betacoronavirus,EPI_ISL_10260254,?,2022-01-03 00:00:00,Africa,Morocco,Khouribga,,Africa,Morocco,Khouribga,genome,29770,Human,unknown,Male,?,BA.1,GRA,NIH,National Institute of Hygiene,"Hassan Ihazmade,Bimouhen Abderrahman,Zakia Regragui,Dr Fatima El Falaki,Pr Hicham Oumzil,Dr ERRAJAOUI HAMID",https://www.gisaid.org/,?,?,2022-02-23 00:00:00,?
hCoV-19/Morocco/FMP-344/2021,betacoronavirus,EPI_ISL_4945298,?,2021-07-12 00:00:00,Africa,Morocco,Ouarzazate,,Africa,Morocco,Ouarzazate,genome,29756,Human,unknown,Female,?,B.1.617.2,GK,Institut National d'HygiÃ¨ne / Consortium National de Veille GÃ©nomique - Maroc,Laboratoire de Biotechnologie,"Mouna Ouadghiri, Tarik Aanniz, Safae El Mazouri, SaaÃ¯d Amzazi, Lahcen Belyamani and Azeddine Ibrahimi",https://www.gisaid.org/,?,?,2021-10-07 00:00:00,?
hCoV-19/Morocco/FMP-350/2021,betacoronavirus,EPI_ISL_4945816,?,2021-07-22 00:00:00,Africa,Morocco,Agadir,,Africa,Morocco,Agadir,genome,29827,Human,unknown,Female,?,AY.51,GK,Institut National d'HygiÃ¨ne / Consortium National de Veille GÃ©nomique - Maroc,Laboratoire de Biotechnologie,"Mouna Ouadghiri, Tarik Aanniz, Safae El Mazouri, SaaÃ¯d Amzazi, Lahcen Belyamani and Azeddine Ibrahimi",https://www.gisaid.org/,?,?,2021-10-07 00:00:00,?
hCoV-19/Morocco/FMP-351/2021,betacoronavirus,EPI_ISL_4945821,?,2021-07-22 00:00:00,Africa,Morocco,Agadir,,Africa,Morocco,Agadir,genome,29795,Human,unknown,Female,?,AY.51,GK,Institut National d'HygiÃ¨ne / Consortium National de Veille GÃ©nomique - Maroc,Laboratoire de Biotechnologie,"Mouna Ouadghiri, Tarik Aanniz, Safae El Mazouri, SaaÃ¯d Amzazi, Lahcen Belyamani and Azeddine Ibrahimi",https://www.gisaid.org/,?,?,2021-10-07 00:00:00,?
hCoV-19/Morocco/FMP-343/2021,betacoronavirus,EPI_ISL_4945008,?,2021-07-13 00:00:00,Africa,Morocco,Chtouka,,Africa,Morocco,Chtouka,genome,29815,Human,unknown,Female,?,AY.33,GK,Institut National d'HygiÃ¨ne / Consortium National de Veille GÃ©nomique - Maroc,Laboratoire de Biotechnologie,"Mouna Ouadghiri, Tarik Aanniz, Safae El Mazouri, SaaÃ¯d Amzazi, Lahcen Belyamani and Azeddine Ibrahimi",https://www.gisaid.org/,?,?,2021-10-07 00:00:00,?